CapDataCulture Ontologie
type: Ontology
description: Pour plus d'informations sur l'utilisation de cette ontologie voir la documentation sur https://gitlab.com/capdataopera/capdata-doc/-/tree/branch/default/Examples
description: To understand more on this ontology, see the documentation here https://gitlab.com/capdataopera/capdata-doc/-/tree/branch/default/Examples @en
title: CapDataCulture Ontology @en
abstract: L'ontologie pour le modèle des données de la Réunion des Opéras de France
abstract: The Réunion des Opéras de France ontology model @en
created: 28 mai 2024
created: May 28th, 2024 @en
creator: Eudes Peyre (ROF)
creator: Fabien Amarger (Logilab)
creator: Logilab
creator: Réunion des Opéras de France
license: http://creativecommons.org/licenses/by/2.0/
status: Published
preferred namespace prefix: rof @en
preferred namespace uri: http://capdataculture.fr/
version info: 1.11.0 @en
introduction: Cette ontologie est utilisée pour faciliter l'interopérabilité entre les données des maisons d'opéra.
introduction: This ontology is used as a pivot model to ease interopability between opera house data. @en

aPourFonction
type: ObjectProperty
domain: Class
  union of: Collectivité
  union of: Participation
  union of: Personne
range: Fonction
comment: Lien vers le référentiel Fonction, indique la fonction occupée par l'objet, une personne ou une collectivité, exemple artiste lyrique, metteur en scène, compositeur...

aPourProfession
type: ObjectProperty
sub property of: aPourFonction
domain: Personne
range: Fonction
comment: Lien vers une personne et le référentiel Fonction, indique la profession occupée par une personne, exemple artiste lyrique, metteur en scène, compositeur...

historique
type: ObjectProperty
domain: Class
  union of: Production
  union of: Production Primaire
range: Historique de Production
comment: Lien vers le référentiel HistoriqueProduction, indique si la production est une création, une nouvelle production, une reprise...

lieuPublication
type: ObjectProperty
domain: Class
  union of: Production
  union of: Production Primaire
range: Lieu Géographique
comment: Le lieu formel de publication ou de représentation de la production culturelle. Cela peut être une ville ou un lieu spécifique où l'objet est officiellement publié ou présenté. (Schema.org : location)

oeuvreRepresentee
type: ObjectProperty
domain: Class
  union of: Production
  union of: Production Primaire
range: Oeuvre
comment: Lien vers l'œuvre qui est mise en scène dans le cadre d'une production. (Schema.org : CreativeWork)

paysDeCreation
type: ObjectProperty
domain: Oeuvre
range: Lieu Géographique
comment: Lien vers un référentiel professionnel indiquant le type officiel de création auquel l'objet culturel est associé. Il peut s'agir d'une "création mondiale", d'une "création française" ou d'une "version concertante".

Date de création ressource
type: DatatypeProperty
range: dateTime
comment: Date de la création de la ressource ayant servie à créer cette entité

Date de modification ressource
type: DatatypeProperty
range: dateTime
comment: Date de la dernière modification de la ressource ayant servie à créer cette entité

datePublication
type: DatatypeProperty
domain: Class
  union of: Production
  union of: Production Primaire
range: dateTime
comment: La date officielle de publication ou de présentation de l'objet culturel. Il s'agit de la date précise ou approximative à laquelle l'objet est rendu accessible au public. (Schema.org : "datePublished")

description
type: DatatypeProperty
equivalent property: description
domain: Class
  union of: Collectivité
  union of: Événement
  union of: Lieu Géographique
  union of: Oeuvre
  union of: Personne
  union of: Production
  union of: Production Primaire
range: string
comment: Une description de l'objet culturel, destinée à fournir des informations précises et pertinentes pour son identification. Par exemple, une description officielle de Wolfgang Amadeus Mozart pourrait inclure ses titres professionnels et ses compétences musicales, exemple "Compositeur, pianiste, violoniste, organiste et chef d'orchestre". (Schema.org : "description")

titre
type: DatatypeProperty
equivalent property: name
domain: Class
  union of: Événement
  union of: Lieu Géographique
  union of: Media
  union of: Oeuvre
  union of: Production
  union of: Production Primaire
range: string
comment: Le nom officiel de l'objet culturel, qu'il s'agisse d'une œuvre, d'une production ou d'un événement artistique. Il est généralement le titre sous lequel l'objet est officiellement enregistré. (Schema.org : name)

Image
type: Class
subclass of: Media

Sound
type: Class
subclass of: Media

Text
type: Class
subclass of: Media

Adresse postale
type: Class
equivalent class: PostalAddress

Auteur
type: Class
subclass of: Participation

Categorie d'oeuvre
type: Class
subclass of: Référentiel

Collaboration technique et artistique
type: Class
subclass of: Participation

Collectivité
type: Class
equivalent class: Organization

Événement
type: Class
equivalent class: Event

Fonction
type: Class
subclass of: Référentiel

Genre d'oeuvre
type: Class
subclass of: Référentiel

Historique de Production
type: Class
subclass of: Référentiel

Interprétation
type: Class
subclass of: Participation

Lieu Géographique
type: Class
equivalent class: Place

Maitrise d'oeuvre
type: Class
subclass of: Participation

Media
type: Class
comment: Pour identifier l'URL de la ressource elle même, utilisez le prédicat http://purl.org/dc/elements/1.1/source

Mention de production
type: Class
subclass of: Participation

Oeuvre
type: Class
equivalent class: CreativeWork

Partenariat
type: Class
subclass of: Participation

Participation
type: Class
comment: Une participation décrit la fonction qu'une personne ou une collectivité occupe dans une production artistique. Par exemple, dans le cas de la production Carmen, la participation de l'Opéra Comique est liée à la fonction de producteur. Une participation se compose de trois éléments : personne ou collectivité la fonction exercée le lien à la production

Pays
type: Class
subclass of: Référentiel

Personne
type: Class
equivalent class: Person

Production
type: Class

Production Primaire
type: Class

Programmation
type: Class
subclass of: Participation

Référentiel
type: Class

Rôle
type: Class
subclass of: Référentiel

Saison
type: Class
subclass of: Référentiel

Statut juridique
type: Class
subclass of: Référentiel

Type d'événement
type: Class
subclass of: Référentiel

Type d'oeuvre
type: Class
subclass of: Référentiel

Type de production
type: Class
subclass of: Référentiel

Type de public
type: Class
equivalent class: Audience
subclass of: Référentiel
comment: Lien vers un référentiel professionnel décrivant les catégories de public auxquelles l'œuvre ou l'objet culturel est spécifiquement destiné. Il peut indiquer si l'objet est conçu pour un public "tout public" ou "scolaire" par exemple. (Schema.org : "audienceType")